{"text_format":"1","workbook":"xlsx","n_sheets":13,"sheets":["Révisions","Explications","Calendrier","Partenaires","Devis","Devis_prorata_temporis","Part. vs. EC prorata","Part. vs. EC","pers.mois vs. EC","Part. vs nature coûts","Lots vs nature coûts","Part. vs lots","Part. vs sous-lots"],"not_rendered":{"charts":0,"images":4,"macros":1,"external_links":0,"defined_names":3,"comments":3,"pivot_tables":7},"unopened":[],"bounds":{"document_bytes":16777216,"sheet_cells":100000,"rows_first":2000,"rows_last":500,"rows_between":2000,"halvings":0,"cell_chars":16384,"cell_head_chars":4096},"cells_cut":0,"cells_raw":0,"read":"whole","date_system":"1900"}

{"sheet":"Révisions","index":0,"n_rows":5,"n_cols":3,"rows_kept":5,"cut":false,"hidden":false,"merged":[]}
["Version","Date","Commentaires"]
["V3","2017-03-03","> Suppression de la validation des données empêchant de renseigner simultanément des coûts de fonctionnement et d'investissement\n> Une ligne de coûts est catégorisée en investissement si la colonne investissement contient une dépense non nulle => modification des logiques ultérieures\n> Suppression des onglets de \"test début de tâche\" et \"test fin de tâche\" \n> Les tâches s'étalant sur plusieurs étapes clés voient leur remplissage sur fond rose\n> Onglet de comparaison entre affectation tâche à EC et prorata temporis"]
["V4","2017-03-06","> Macro de ventilation du devis au prorata temporis"]
["V5","2017-03-13","> toilettage macro prorata temporis avec bouton d'exécution."]
["V6","2017-03-31","> Explications si erreur dans certaines formule (recherche EC)\n> Correction de la formule recherche EC pour fonctionner avec tâche 1 mois en fin de calendrier"]

{"sheet":"Explications","index":1,"n_rows":0,"n_cols":0,"rows_kept":0,"cut":false,"hidden":false,"merged":[]}

{"sheet":"Calendrier","index":2,"n_rows":7,"n_cols":3,"rows_kept":7,"cut":false,"hidden":false,"merged":[]}
["T0","2017-02-01"]
[]
["Etapes clés","Délais en mois","Date prévisionnelle"]
["T0",0,{"$f":"EDATE(T0,B4)","v":"2017-02-01"}]
["EC01",12,{"$f":"EDATE(T0,B5)","v":"2018-02-01"}]
["EC02",24,{"$f":"EDATE(T0,B6)","v":"2019-02-01"}]
["EC03",36,{"$f":"EDATE(T0,B7)","v":"2020-02-01"}]

{"sheet":"Partenaires","index":3,"n_rows":6,"n_cols":7,"rows_kept":6,"cut":false,"hidden":false,"merged":[]}
["Nom court","Nom des partenaires ","Salaire Cat. 1","Salaire Cat. 2","Salaire Cat. 3","Catégorie partenaire","Type de coûts"]
["IXE","Société IXE SARL",8000,6000,4000,"PE","Complets"]
["IGREC","Société IGREC SA",7500,5000,3500,"ME","Complets"]
["ZED","Grande entreprise ZED",8500,5500,3000,"GE","Complets"]
["ALPHA","Laboratoire université ALPHA",6000,5500,4000,"Labo","Complets"]
["BETA","Laboratoire université BETA",6000,5500,4000,"Labo","Marginaux"]

{"sheet":"Devis","index":4,"n_rows":35,"n_cols":30,"rows_kept":35,"cut":false,"hidden":false,"merged":[[2,3,2,7],[2,16,2,19],[3,16,3,19]]}
[]
[]
[null,null,null,"Nombre de valeurs uniques (tâches, partenaires, livrables)",null,null,null,null,{"$f":"SUM(Devis[Personne.mois cat 1])","v":358},{"$f":"SUM(Devis[Personne.mois cat 2])","v":152},{"$f":"SUM(Devis[Personne.mois cat 3])","v":38},{"$f":"SUM(Devis[Dépenses de sous-traitance H.T.])","v":1008500},{"$f":"SUM(Devis[Contribution aux amortissements])","v":392500},{"$f":"SUM(Devis[Autres dépenses])","v":232500},{"$f":"SUM(Devis[Investissements])","v":950000},{"$f":"SUM(Devis[Classification])","v":0},"<== TOTAL ==>",null,null,null,{"$f":"SUM(Devis[Total pers.mois présentés])","v":533},{"$f":"SUM(Devis[Salaires])","v":3785000},{"$f":"SUM(Devis[Frais généraux])","v":757000},{"$f":"SUM(Devis[Sous-traitance])","v":1008500},{"$f":"SUM(Devis[Dotations aux amortissements])","v":392500},{"$f":"SUM(Devis[Autres dépenses2])","v":232500},{"$f":"SUM(Devis[Coûts de fonctionnement])","v":6047900},{"$f":"SUM(Devis[Coûts d''investissement])","v":1077600},{"$f":"SUM(Devis[Coûts totaux])","v":7125500}]
[null,null,null,{"$f":"SUMPRODUCT(1/COUNTIF(Devis[Intitulé de la tache ou de l''investissement],Devis[Intitulé de la tache ou de l''investissement]))","v":13},{"$f":"SUMPRODUCT(1/COUNTIF(Devis[Partenaire],Devis[Partenaire]))","v":4.9999999999999973},null,null,{"$f":"SUMPRODUCT(1/COUNTIF(Devis[Livrable],Devis[Livrable]))","v":16},{"$f":"SUBTOTAL(9,Devis[Personne.mois cat 1])","v":358},{"$f":"SUBTOTAL(9,Devis[Personne.mois cat 2])","v":152},{"$f":"SUBTOTAL(9,Devis[Personne.mois cat 3])","v":38},{"$f":"SUBTOTAL(9,Devis[Dépenses de sous-traitance H.T.])","v":1008500},{"$f":"SUBTOTAL(9,Devis[Contribution aux amortissements])","v":392500},{"$f":"SUBTOTAL(9,Devis[Autres dépenses])","v":232500},{"$f":"SUBTOTAL(9,Devis[Investissements])","v":950000},{"$f":"SUBTOTAL(9,Devis[Classification])","v":0},"<== SOUS TOTAL ==>",null,null,null,{"$f":"SUBTOTAL(9,Devis[Total pers.mois présentés])","v":533},{"$f":"SUBTOTAL(9,Devis[Salaires])","v":3785000},{"$f":"SUBTOTAL(9,Devis[Frais généraux])","v":757000},{"$f":"SUBTOTAL(9,Devis[Sous-traitance])","v":1008500},{"$f":"SUBTOTAL(9,Devis[Dotations aux amortissements])","v":392500},{"$f":"SUBTOTAL(9,Devis[Autres dépenses2])","v":232500},{"$f":"SUBTOTAL(9,Devis[Coûts de fonctionnement])","v":6047900},{"$f":"SUBTOTAL(9,Devis[Coûts d''investissement])","v":1077600},{"$f":"SUBTOTAL(9,Devis[Coûts totaux])","v":7125500}]
[null,"zone de saisie",null,null,"zone de saisie",null,null,"zone de saisie",null,null,"zone de saisie",null,null,"zone de saisie",null,null,"Colonnes calculées, ne rien modifier",null,"Colonnes calculées, ne rien modifier",null,"Colonnes calculées, ne rien modifier",null,null,"Colonnes calculées, ne rien modifier",null,null,"Colonnes calculées, ne rien modifier"]
["Lot","Sous-lot (facultatif)","Tache","Intitulé de la tache ou de l'investissement","Partenaire","Mois de début","Mois de fin","Livrable","Personne.mois cat 1","Personne.mois cat 2","Personne.mois cat 3","Dépenses de sous-traitance H.T.","Contribution aux amortissements","Autres dépenses","Investissements","Classification","Destination des aides","Type de coûts","Durée","Etape-clef","Total pers.mois présentés","Salaires","Frais généraux","Sous-traitance","Dotations aux amortissements","Autres dépenses2","Coûts de fonctionnement","Coûts d'investissement","Coûts totaux","Tâche couvrant plusieurs EC"]
["LOT 1",null,1,"Gestion de projet","IXE",1,12,"1.1",1,null,null,null,null,1000,null,null,{"$f":"IF(Devis[[#This Row],[Investissements]]>0,\"Investissement\",\"Fonctionnement\")","v":"Fonctionnement"},{"$f":"INDEX(Partenaires[Type de coûts],MATCH(Devis[[#This Row],[Partenaire]],Partenaires[Nom court],0))","v":"Complets"},{"$f":"Devis[[#This Row],[Mois de fin]]-Devis[[#This Row],[Mois de début]]+1","v":12},{"$f":"IFERROR(INDEX(Calendrier[Etapes clés],MATCH(INT((Devis[[#This Row],[Mois de début]]+Devis[[#This Row],[Mois de fin]]+1)/2)-1,Calendrier[Délais en mois],1)+1),\"#! Vérifiez l'onglet Calendrier et que le milieu de la tâche tombe bien dans une étape clé\")","v":"EC01"},{"$f":"IF(Devis[[#This Row],[Destination des aides]]=\"Fonctionnement\",SUM(Devis[[#This Row],[Personne.mois cat 1]:[Personne.mois cat 3]]),0)","v":1},{"$f":"  SUMPRODUCT(INDEX(Partenaires[[Salaire Cat. 1]:[Salaire Cat. 3]],MATCH(Devis[[#This Row],[Partenaire]],Partenaires[Nom court],0),),Devis[[#This Row],[Personne.mois cat 1]:[Personne.mois cat 3]])","v":8000},{"$f":"20%*Devis[[#This Row],[Salaires]]","v":1600},{"$f":"Devis[[#This Row],[Dépenses de sous-traitance H.T.]]","v":0},{"$f":"Devis[[#This Row],[Contribution aux amortissements]]","v":0},{"$f":"Devis[[#This Row],[Autres dépenses]]","v":1000},{"$f":"IF(Devis[[#This Row],[Destination des aides]]=\"Fonctionnement\",SUM(Devis[[#This Row],[Salaires]:[Autres dépenses2]]),0)","v":10600},{"$f":"IF(Devis[[#This Row],[Destination des aides]]=\"Investissement\",SUM(Devis[[#This Row],[Salaires]:[Autres dépenses2]],Devis[[#This Row],[Investissements]]),0)","v":0},{"$f":"Devis[[#This Row],[Coûts de fonctionnement]]+Devis[[#This Row],[Coûts d''investissement]]","v":10600},{"$f":"(MATCH(Devis[[#This Row],[Mois de début]]-1,Calendrier[Délais en mois],1)<>MATCH(Devis[[#This Row],[Mois de fin]]-1,Calendrier[Délais en mois],1))","v":false}]
["LOT 1",null,2,"Gestion de projet","IXE",13,18,"1.2",1,null,null,null,null,1000,null,null,{"$f":"IF(Devis[[#This Row],[Investissements]]>0,\"Investissement\",\"Fonctionnement\")","v":"Fonctionnement"},{"$f":"INDEX(Partenaires[Type de coûts],MATCH(Devis[[#This Row],[Partenaire]],Partenaires[Nom court],0))","v":"Complets"},{"$f":"Devis[[#This Row],[Mois de fin]]-Devis[[#This Row],[Mois de début]]+1","v":6},{"$f":"IFERROR(INDEX(Calendrier[Etapes clés],MATCH(INT((Devis[[#This Row],[Mois de début]]+Devis[[#This Row],[Mois de fin]]+1)/2)-1,Calendrier[Délais en mois],1)+1),\"#! Vérifiez l'onglet Calendrier et que le milieu de la tâche tombe bien dans une étape clé\")","v":"EC02"},{"$f":"IF(Devis[[#This Row],[Destination des aides]]=\"Fonctionnement\",SUM(Devis[[#This Row],[Personne.mois cat 1]:[Personne.mois cat 3]]),0)","v":1},{"$f":"  SUMPRODUCT(INDEX(Partenaires[[Salaire Cat. 1]:[Salaire Cat. 3]],MATCH(Devis[[#This Row],[Partenaire]],Partenaires[Nom court],0),),Devis[[#This Row],[Personne.mois cat 1]:[Personne.mois cat 3]])","v":8000},{"$f":"20%*Devis[[#This Row],[Salaires]]","v":1600},{"$f":"Devis[[#This Row],[Dépenses de sous-traitance H.T.]]","v":0},{"$f":"Devis[[#This Row],[Contribution aux amortissements]]","v":0},{"$f":"Devis[[#This Row],[Autres dépenses]]","v":1000},{"$f":"IF(Devis[[#This Row],[Destination des aides]]=\"Fonctionnement\",SUM(Devis[[#This Row],[Salaires]:[Autres dépenses2]]),0)","v":10600},{"$f":"IF(Devis[[#This Row],[Destination des aides]]=\"Investissement\",SUM(Devis[[#This Row],[Salaires]:[Autres dépenses2]],Devis[[#This Row],[Investissements]]),0)","v":0},{"$f":"Devis[[#This Row],[Coûts de fonctionnement]]+Devis[[#This Row],[Coûts d''investissement]]","v":10600},{"$f":"(MATCH(Devis[[#This Row],[Mois de début]]-1,Calendrier[Délais en mois],1)<>MATCH(Devis[[#This Row],[Mois de fin]]-1,Calendrier[Délais en mois],1))","v":false}]
{"$rows_left_out":28}
{"sheet":"Devis_prorata_temporis","index":5,"n_rows":37,"n_cols":29,"rows_kept":37,"cut":false,"hidden":false,"merged":[]}
[]
[]
[]
[]
[null,"zone de saisie",null,null,"zone de saisie",null,null,"zone de saisie",null,null,"zone de saisie",null,null,"zone de saisie",null,"Colonnes calculées, ne rien modifier",null,"Colonnes calculées, ne rien modifier",null,"Colonnes calculées, ne rien modifier",null,null,"Colonnes calculées, ne rien modifier",null,null,"Colonnes calculées, ne rien modifier"]
["Lot","Sous-lot (facultatif)","Tache","Intitulé de la tache ou de l'investissement","Partenaire","Mois de début","Mois de fin","Livrable","Personne.mois cat 1","Personne.mois cat 2","Personne.mois cat 3","Dépenses de sous-traitance H.T.","Contribution aux amortissements","Autres dépenses","Investissements","Destination des aides","Type de coûts","Durée","Etape-clef","Total pers.mois présentés","Salaires","Frais généraux","Sous-traitance","Dotations aux amortissements","Autres dépenses2","Coûts de fonctionnement","Coûts d'investissement","Coûts totaux","Tâche couvrant plusieurs EC"]
["LOT 1",null,1,"Gestion de projet","IXE",1,12,"1.1",1,null,null,null,null,1000,null,{"$f":"IF(Prorata_temporis[[#This Row],[Investissements]]>0,\"Investissement\",\"Fonctionnement\")","v":"Fonctionnement"},{"$f":"INDEX(Partenaires[Type de coûts],MATCH(Prorata_temporis[[#This Row],[Partenaire]],Partenaires[Nom court],0))","v":"Complets"},{"$f":"Prorata_temporis[[#This Row],[Mois de fin]]-Prorata_temporis[[#This Row],[Mois de début]]+1","v":12},{"$f":"IFERROR(INDEX(Calendrier[Etapes clés],MATCH(INT((Prorata_temporis[[#This Row],[Mois de début]]+Prorata_temporis[[#This Row],[Mois de fin]]+1)/2),Calendrier[Délais en mois],1)+1),\"#! Vérifiez l'onglet Calendrier et que le milieu de la tâche tombe bien dans une étape clé\")","v":"EC01"},{"$f":"IF(Prorata_temporis[[#This Row],[Destination des aides]]=\"Fonctionnement\",SUM(Prorata_temporis[[#This Row],[Personne.mois cat 1]:[Personne.mois cat 3]]),0)","v":1},{"$f":"         SUMPRODUCT(INDEX(Partenaires[[Salaire Cat. 1]:[Salaire Cat. 3]],MATCH(Prorata_temporis[[#This Row],[Partenaire]],Partenaires[Nom court],0),),Prorata_temporis[[#This Row],[Personne.mois cat 1]:[Personne.mois cat 3]])","v":8000},{"$f":"20%*Prorata_temporis[[#This Row],[Salaires]]","v":1600},{"$f":"Prorata_temporis[[#This Row],[Dépenses de sous-traitance H.T.]]","v":0},{"$f":"Prorata_temporis[[#This Row],[Contribution aux amortissements]]","v":0},{"$f":"Prorata_temporis[[#This Row],[Autres dépenses]]","v":1000},{"$f":"IF(Prorata_temporis[[#This Row],[Destination des aides]]=\"Fonctionnement\",SUM(Prorata_temporis[[#This Row],[Salaires]:[Autres dépenses2]]),0)","v":10600},{"$f":"IF(Prorata_temporis[[#This Row],[Destination des aides]]=\"Investissement\",ROUND(SUM(Prorata_temporis[[#This Row],[Salaires]:[Autres dépenses2]],Prorata_temporis[[#This Row],[Investissements]]),0),0)","v":0},{"$f":"Prorata_temporis[[#This Row],[Coûts de fonctionnement]]+Prorata_temporis[[#This Row],[Coûts d''investissement]]","v":10600},{"$f":"(MATCH(Prorata_temporis[[#This Row],[Mois de début]]-1,Calendrier[Délais en mois],1)<>MATCH(Prorata_temporis[[#This Row],[Mois de fin]]-1,Calendrier[Délais en mois],1))","v":false}]
["LOT 1",null,2,"Gestion de projet","IXE",13,18,"1.2",1,null,null,null,null,1000,null,{"$f":"IF(Prorata_temporis[[#This Row],[Investissements]]>0,\"Investissement\",\"Fonctionnement\")","v":"Fonctionnement"},{"$f":"INDEX(Partenaires[Type de coûts],MATCH(Prorata_temporis[[#This Row],[Partenaire]],Partenaires[Nom court],0))","v":"Complets"},{"$f":"Prorata_temporis[[#This Row],[Mois de fin]]-Prorata_temporis[[#This Row],[Mois de début]]+1","v":6},{"$f":"IFERROR(INDEX(Calendrier[Etapes clés],MATCH(INT((Prorata_temporis[[#This Row],[Mois de début]]+Prorata_temporis[[#This Row],[Mois de fin]]+1)/2),Calendrier[Délais en mois],1)+1),\"#! Vérifiez l'onglet Calendrier et que le milieu de la tâche tombe bien dans une étape clé\")","v":"EC02"},{"$f":"IF(Prorata_temporis[[#This Row],[Destination des aides]]=\"Fonctionnement\",SUM(Prorata_temporis[[#This Row],[Personne.mois cat 1]:[Personne.mois cat 3]]),0)","v":1},{"$f":"         SUMPRODUCT(INDEX(Partenaires[[Salaire Cat. 1]:[Salaire Cat. 3]],MATCH(Prorata_temporis[[#This Row],[Partenaire]],Partenaires[Nom court],0),),Prorata_temporis[[#This Row],[Personne.mois cat 1]:[Personne.mois cat 3]])","v":8000},{"$f":"20%*Prorata_temporis[[#This Row],[Salaires]]","v":1600},{"$f":"Prorata_temporis[[#This Row],[Dépenses de sous-traitance H.T.]]","v":0},{"$f":"Prorata_temporis[[#This Row],[Contribution aux amortissements]]","v":0},{"$f":"Prorata_temporis[[#This Row],[Autres dépenses]]","v":1000},{"$f":"IF(Prorata_temporis[[#This Row],[Destination des aides]]=\"Fonctionnement\",SUM(Prorata_temporis[[#This Row],[Salaires]:[Autres dépenses2]]),0)","v":10600},{"$f":"IF(Prorata_temporis[[#This Row],[Destination des aides]]=\"Investissement\",ROUND(SUM(Prorata_temporis[[#This Row],[Salaires]:[Autres dépenses2]],Prorata_temporis[[#This Row],[Investissements]]),0),0)","v":0},{"$f":"Prorata_temporis[[#This Row],[Coûts de fonctionnement]]+Prorata_temporis[[#This Row],[Coûts d''investissement]]","v":10600},{"$f":"(MATCH(Prorata_temporis[[#This Row],[Mois de début]]-1,Calendrier[Délais en mois],1)<>MATCH(Prorata_temporis[[#This Row],[Mois de fin]]-1,Calendrier[Délais en mois],1))","v":false}]
{"$rows_left_out":30}
{"sheet":"Part. vs. EC prorata","index":6,"n_rows":14,"n_cols":9,"rows_kept":14,"cut":false,"hidden":false,"merged":[]}
[null,null,null,null,null,null,null,null,"Devis sans prorata temporis"]
[]
["Somme de Coûts totaux",null,"Etape-clef"]
["Destination des aides","Partenaire","EC01","EC02","EC03","Total général"]
["Fonctionnement","ALPHA",70500,87400,null,157900]
[null,"BETA",70500,87400,null,157900]
[null,"IGREC",194000,278526.31578947371,869473.68421052629,1342000]
[null,"IXE",440266.66666666674,712133.33333333326,2218200,3370600]
{"$rows_left_out":7}
{"sheet":"Part. vs. EC","index":7,"n_rows":14,"n_cols":6,"rows_kept":14,"cut":false,"hidden":false,"merged":[]}
[]
[]
["Somme de Coûts totaux",null,"Etape-clef"]
["Destination des aides","Partenaire","EC01","EC02","EC03","Total général"]
["Fonctionnement","ALPHA",70500,87400,null,157900]
[null,"BETA",70500,87400,null,157900]
[null,"IGREC",194000,224000,970000,1388000]
[null,"IXE",526200,626200,2218200,3370600]
{"$rows_left_out":7}
{"sheet":"pers.mois vs. EC","index":8,"n_rows":13,"n_cols":6,"rows_kept":13,"cut":false,"hidden":false,"merged":[]}
[]
["Somme de Total pers.mois présentés",null,"Etape-clef"]
["Destination des aides","Partenaire","EC01","EC02","EC03","Total général"]
["Fonctionnement","ALPHA",9,12,null,21]
[null,"BETA",9,12,null,21]
[null,"IGREC",18,18,89,125]
[null,"IXE",43,43,181,267]
[null,"ZED",9,18,72,99]
{"$rows_left_out":6}
{"sheet":"Part. vs nature coûts","index":9,"n_rows":11,"n_cols":9,"rows_kept":11,"cut":false,"hidden":false,"merged":[[2,0,2,2]]}
[]
[]
[]
[null,"Données"]
["Partenaire","Somme de Salaires","Somme de Frais généraux","Somme de Sous-traitance","Somme de Dotations aux amortissements","Somme de Autres dépenses","Somme de Coûts de fonctionnement","Somme de Coûts d'investissement","Somme de Coûts totaux"]
["IXE",1914000,382800,725000,300000,128000,3370600,329200,3699800]
["IGREC",879500,175900,251000,60000,70000,1388000,748400,2136400]
["ZED",742500,148500,27500,27500,27500,973500,0,973500]
{"$rows_left_out":4}
{"sheet":"Lots vs nature coûts","index":10,"n_rows":12,"n_cols":10,"rows_kept":12,"cut":false,"hidden":false,"merged":[[2,0,2,2]]}
[]
[]
[]
[null,null,"Données"]
["Lot","Sous-lot (facultatif)","Somme de Salaires","Somme de Frais généraux","Somme de Sous-traitance","Somme de Dotations aux amortissements","Somme de Autres dépenses","Somme de Coûts de fonctionnement","Somme de Coûts d'investissement","Somme de Coûts totaux"]
["LOT 1","(vide)",24000,4800,0,0,3000,31800,0,31800]
["LOT 2","(vide)",1063500,212700,207500,102500,59500,1645700,0,1645700]
["LOT 3","(vide)",2172000,434400,540000,260000,140000,3546400,0,3546400]
{"$rows_left_out":5}
{"sheet":"Part. vs lots","index":11,"n_rows":11,"n_cols":8,"rows_kept":11,"cut":false,"hidden":false,"merged":[[2,0,2,2]]}
[]
[]
[]
["Somme de Coûts totaux","Lot"]
["Partenaire","LOT 1","LOT 2","LOT 3","LOT 4","LOT 5","LOT 6","Total général"]
["IXE",31800,773400,2062400,357800,329200,145200,3699800]
["IGREC",0,291000,776000,127000,748400,194000,2136400]
["ZED",0,265500,708000,0,0,0,973500]
{"$rows_left_out":4}
{"sheet":"Part. vs sous-lots","index":12,"n_rows":27,"n_cols":3,"rows_kept":27,"cut":false,"hidden":false,"merged":[[2,0,2,2]]}
[]
[]
[]
["Somme de Coûts totaux"]
["Lot","Partenaire","Total"]
["LOT 1","IXE",31800]
["Total LOT 1",null,31800]
["LOT 2","IXE",773400]
{"$rows_left_out":19}